Reaction Details
Target5'-nucleotidase
LigandBDBM50395094
Substrate/Competitorn/a
Meas. Tech.ChEMBL_859457 (CHEMBL2167535)
IC50 9460±n/a nM
Citation Ripphausen, PFreundlieb, MBrunschweiger, AZimmermann, HMüller, CEBajorath, J Virtual screening identifies novel sulfonamide inhibitors of ecto-5'-nucleotidase. J Med Chem55:6576-81 (2012) 
 
5'-nucleotidase
Name:5'-nucleotidase
Type:Enzyme
Mol. Mass.:63971.44
Organism:Rattus norvegicus (Rat)
Description:P21588
Residue:576
BDBM50395094
NameBDBM50395094
Synonyms:CHEMBL2164291
TypeSmall organic molecule
Emp. Form.C13H12N4O5S
Mol. Mass.336.323
SMILESNS(=O)(=O)c1ccc(\[NH+]=N\[CH-]c2ccccc2O)c(c1)[N+]([O-])=O