Reaction Details
TargetMu-type opioid receptor
LigandBDBM50395112
Substrate/Competitorn/a
Meas. Tech.ChEMBL_859458 (CHEMBL2167536)
Ki 0.29±n/a nM
Citation Majumdar, SSubrath, JLe Rouzic, VPolikar, LBurgman, MNagakura, KOcampo, JHaselton, NPasternak, ARGrinnell, SPan, YXPasternak, GW Synthesis and evaluation of aryl-naloxamide opiate analgesics targeting truncated exon 11-associatedµ opioid receptor (MOR-1) splice variants. J Med Chem55:6352-62 (2012) 
 
Mu-type opioid receptor
Name:Mu-type opioid receptor
Type:Enzyme Catalytic Domain
Mol. Mass.:44431.62
Organism:MOUSE
Description:OPIATE Mu OPRM1 MOUSE::P42866
Residue:398
BDBM50395112
NameBDBM50395112
Synonyms:CHEMBL2163541
TypeSmall organic molecule
Emp. Form.C27H30N2O4
Mol. Mass.446.5381
SMILESCc1cccc(c1)C(=O)N[C@@H]1CC[C@@]2(O)[C@H]3Cc4ccc(O)c5O[C@@H]1[C@]2(CCN3CC=C)c45