Reaction Details
TargetMu-type opioid receptor
LigandBDBM50395116
Substrate/Competitorn/a
Meas. Tech.ChEMBL_859458 (CHEMBL2167536)
Ki 0.47±n/a nM
Citation Majumdar, SSubrath, JLe Rouzic, VPolikar, LBurgman, MNagakura, KOcampo, JHaselton, NPasternak, ARGrinnell, SPan, YXPasternak, GW Synthesis and evaluation of aryl-naloxamide opiate analgesics targeting truncated exon 11-associatedµ opioid receptor (MOR-1) splice variants. J Med Chem55:6352-62 (2012) 
 
Mu-type opioid receptor
Name:Mu-type opioid receptor
Type:Enzyme Catalytic Domain
Mol. Mass.:44431.62
Organism:MOUSE
Description:OPIATE Mu OPRM1 MOUSE::P42866
Residue:398
BDBM50395116
NameBDBM50395116
Synonyms:CHEMBL2163537
TypeSmall organic molecule
Emp. Form.C26H27FN2O4
Mol. Mass.450.502
SMILESOc1ccc2C[C@H]3N(CC=C)CC[C@@]45[C@@H](Oc1c24)[C@@H](CC[C@@]35O)NC(=O)c1cccc(F)c1