Reaction Details
TargetKappa-type opioid receptor
LigandBDBM50395102
Substrate/Competitorn/a
Meas. Tech.ChEMBL_859459 (CHEMBL2167537)
Ki>100±n/a nM
Citation Majumdar, SSubrath, JLe Rouzic, VPolikar, LBurgman, MNagakura, KOcampo, JHaselton, NPasternak, ARGrinnell, SPan, YXPasternak, GW Synthesis and evaluation of aryl-naloxamide opiate analgesics targeting truncated exon 11-associatedµ opioid receptor (MOR-1) splice variants. J Med Chem55:6352-62 (2012) 
 
Kappa-type opioid receptor
Name:Kappa-type opioid receptor
Type:Enzyme
Mol. Mass.:42656.78
Organism:Mus musculus (Mouse)
Description:P33534
Residue:380
BDBM50395102
NameBDBM50395102
Synonyms:CHEMBL2164299
TypeSmall organic molecule
Emp. Form.C21H26N2O4
Mol. Mass.370.4421
SMILESCC(=O)N[C@@H]1CC[C@@]2(O)[C@H]3Cc4ccc(O)c5O[C@@H]1[C@]2(CCN3CC=C)c45