Reaction Details
TargetKappa-type opioid receptor
LigandBDBM50395111
Substrate/Competitorn/a
Meas. Tech.ChEMBL_859459 (CHEMBL2167537)
Ki 0.22±n/a nM
Citation Majumdar, SSubrath, JLe Rouzic, VPolikar, LBurgman, MNagakura, KOcampo, JHaselton, NPasternak, ARGrinnell, SPan, YXPasternak, GW Synthesis and evaluation of aryl-naloxamide opiate analgesics targeting truncated exon 11-associatedµ opioid receptor (MOR-1) splice variants. J Med Chem55:6352-62 (2012) 
 
Kappa-type opioid receptor
Name:Kappa-type opioid receptor
Type:Enzyme
Mol. Mass.:42656.78
Organism:Mus musculus (Mouse)
Description:P33534
Residue:380
BDBM50395111
NameBDBM50395111
Synonyms:CHEMBL2163542
TypeSmall organic molecule
Emp. Form.C27H27F3N2O4
Mol. Mass.500.5095
SMILESOc1ccc2C[C@H]3N(CC=C)CC[C@@]45[C@@H](Oc1c24)[C@@H](CC[C@@]35O)NC(=O)c1cccc(c1)C(F)(F)F