Reaction Details
TargetDelta-type opioid receptor
LigandBDBM50395104
Substrate/Competitorn/a
Meas. Tech.ChEMBL_859460 (CHEMBL2167538)
Ki 5.51±n/a nM
Citation Majumdar, SSubrath, JLe Rouzic, VPolikar, LBurgman, MNagakura, KOcampo, JHaselton, NPasternak, ARGrinnell, SPan, YXPasternak, GW Synthesis and evaluation of aryl-naloxamide opiate analgesics targeting truncated exon 11-associatedµ opioid receptor (MOR-1) splice variants. J Med Chem55:6352-62 (2012) 
 
Delta-type opioid receptor
Name:Delta-type opioid receptor
Type:Enzyme Catalytic Domain
Mol. Mass.:40577.25
Organism:MOUSE
Description:P32300
Residue:372
BDBM50395104
NameBDBM50395104
Synonyms:CHEMBL2164297
TypeSmall organic molecule
Emp. Form.C30H30N2O4
Mol. Mass.482.5702
SMILESOc1ccc2C[C@H]3N(CC=C)CC[C@@]45[C@@H](Oc1c24)[C@@H](CC[C@@]35O)NC(=O)c1ccc2ccccc2c1