Reaction Details
TargetAdenosine receptor A2a
LigandBDBM50395122
Substrate/Competitorn/a
Meas. Tech.ChEMBL_859653 (CHEMBL2168890)
Ki 4700±n/a nM
Citation Korboukh, IHull-Ryde, EARittiner, JERandhawa, ASColeman, JFitzpatrick, BJSetola, VJanzen, WPFrye, SVZylka, MJJin, J Orally active adenosine A(1) receptor agonists with antinociceptive effects in mice. J Med Chem55:6467-77 (2012) 
 
Adenosine receptor A2a
Name:Adenosine receptor A2a
Type:G Protein-Coupled Receptor (GPCR)
Mol. Mass.:44716.46
Organism:Homo sapiens (Human)
Description:P29274
Residue:412
BDBM50395122
NameBDBM50395122
Synonyms:CHEMBL2163561
TypeSmall organic molecule
Emp. Form.C17H25ClN5O7P
Mol. Mass.477.836
SMILESCOP(=O)(OC)OC[C@H]1O[C@H]([C@H](O)[C@@H]1O)n1cnc2c(NC3CCCC3)nc(Cl)nc12