Reaction Details
TargetCannabinoid receptor 2
LigandBDBM50395158
Substrate/Competitorn/a
Meas. Tech.ChEMBL_859793 (CHEMBL2169621)
Ki 13.2±n/a nM
Citation Baraldi, PGSaponaro, GMoorman, ARRomagnoli, RPreti, DBaraldi, SRuggiero, EVarani, KTarga, MVincenzi, FBorea, PAAghazadeh Tabrizi, M 7-Oxo-[1,4]oxazino[2,3,4-ij]quinoline-6-carboxamides as selective CB(2) cannabinoid receptor ligands: structural investigations around a novel class of full agonists. J Med Chem55:6608-23 (2012) 
 
Cannabinoid receptor 2
Name:Cannabinoid receptor 2
Type:Enzyme
Mol. Mass.:39366.68
Organism:Rattus norvegicus (Rat)
Description:Q9QZN9
Residue:360
BDBM50395158
NameBDBM50395158
Synonyms:CHEMBL2163940
TypeSmall organic molecule
Emp. Form.C26H32N2O3
Mol. Mass.420.5439
SMILESCCCC1COc2ccc(C)c3c2n1cc(C(=O)NC12CC4CC(CC(C4)C1)C2)c3=O