Reaction Details
Target5-hydroxytryptamine receptor 1A
LigandBDBM86708
Substrate/Competitorn/a
Meas. Tech.ChEMBL_859983 (CHEMBL2167566)
Ki 0.25±n/a nM
Citation Mangin, FDilly, SJoly, BScuvée-Moreau, JEvans, JSetola, VRoth, BLLiégeois, JF Moderate chemical modifications of WAY-100635 improve the selectivity for 5-HT1A versus D4 receptors. Bioorg Med Chem Lett22:4550-4 (2012) 
 
5-hydroxytryptamine receptor 1A
Name:5-hydroxytryptamine receptor 1A
Type:n/a
Mol. Mass.:46122.49
Organism:Homo sapiens (Human)
Description:n/a
Residue:422
BDBM86708
NameBDBM86708
Synonyms:CAS_146714-97-8 CHEMBL514874 NSC_104911 | WAY 100,635
TypeSmall organic molecule
Emp. Form.C25H34N4O2
Mol. Mass.422.5631
SMILESCOc1ccccc1N1CCN(CCN(C(=O)C2CCCCC2)c2ccccn2)CC1