Reaction Details
TargetNeuronal acetylcholine receptor subunit alpha-7
LigandBDBM50166908
Substrate/Competitorn/a
Meas. Tech.ChEMBL_860160 (CHEMBL2168701)
Ki 32.5±n/a nM
Citation Ondachi, PCastro, ALuetje, CWDamaj, MIMascarella, SWNavarro, HACarroll, FI Synthesis and nicotinic acetylcholine receptor in vitro and in vivo pharmacological properties of 2'-fluoro-3'-(substituted phenyl)deschloroepibatidine analogues of 2'-fluoro-3'-(4-nitrophenyl)deschloroepibatidine. J Med Chem55:6512-22 (2012) 
 
Neuronal acetylcholine receptor subunit alpha-7
Name:Neuronal acetylcholine receptor subunit alpha-7
Type:Enzyme
Mol. Mass.:56502.44
Organism:Rattus norvegicus (Rat)
Description:Q05941
Residue:502
BDBM50166908
NameBDBM50166908
Synonyms:5,8,14-triazatetracyclo[10.3.1.02,11.04,9]hexadeca-2(11),3,5,7,9-pentaene; dihydrochloride US9993465, Varenicline | VARENICLINE
TypeSmall organic molecule
Emp. Form.C13H13N3
Mol. Mass.211.2624
SMILESC1C2CNCC1c1cc3nccnc3cc21