Reaction Details
TargetCathepsin K
LigandBDBM50395250
Substrate/Competitorn/a
Meas. Tech.ChEMBL_860167 (CHEMBL2168708)
IC50 3±n/a nM
Citation Dossetter, AGBeeley, HBowyer, JCook, CRCrawford, JJFinlayson, JEHeron, NMHeyes, CHighton, AJHudson, JAJestel, AKenny, PWKrapp, SMartin, SMacFaul, PAMcGuire, TMGutierrez, PMMorley, ADMorris, JJPage, KMRibeiro, LRSawney, HSteinbacher, SSmith, CVickers, M (1R,2R)-N-(1-cyanocyclopropyl)-2-(6-methoxy-1,3,4,5-tetrahydropyrido[4,3-b]indole-2-carbonyl)cyclohexanecarboxamide (AZD4996): a potent and highly selective cathepsin K inhibitor for the treatment of osteoarthritis. J Med Chem55:6363-74 (2012) 
 
Cathepsin K
Name:Cathepsin K
Type:Enzyme
Mol. Mass.:36975.68
Organism:Homo sapiens (Human)
Description:P43235
Residue:329
BDBM50395250
NameBDBM50395250
Synonyms:CHEMBL2164687
TypeSmall organic molecule
Emp. Form.C23H25ClN4O2
Mol. Mass.424.923
SMILESClc1ccc2[nH]c3CCN(Cc3c2c1)C(=O)[C@@H]1CCCC[C@H]1C(=O)NC1(CC1)C#N