Reaction Details
TargetPotassium voltage-gated channel subfamily H member 2
LigandBDBM50395333
Substrate/Competitorn/a
Meas. Tech.ChEMBL_860769 (CHEMBL2168489)
IC50 4600±n/a nM
Citation Macsari, IBesidski, YCsjernyik, GNilsson, LISandberg, LYngve, UAhlin, KBueters, TEriksson, ABLund, PEVenyike, EOerther, SHygge Blakeman, KLuo, LArvidsson, PI 3-Oxoisoindoline-1-carboxamides: potent, state-dependent blockers of voltage-gated sodium channel Na(V)1.7 with efficacy in rat pain models. J Med Chem55:6866-80 (2012) 
 
Potassium voltage-gated channel subfamily H member 2
Name:Potassium voltage-gated channel subfamily H member 2
Type:Multi-pass membrane protein
Mol. Mass.:126672.65
Organism:Homo sapiens (Human)
Description:Q12809
Residue:1159
BDBM50395333
NameBDBM50395333
Synonyms:CHEMBL2164389
TypeSmall organic molecule
Emp. Form.C24H20F3N3O3
Mol. Mass.455.4291
SMILESFC(F)(F)Oc1ccc(CNC(=O)C2N(CCc3ccccn3)C(=O)c3ccccc23)cc1