Reaction Details
TargetSodium channel protein type 9 subunit alpha
LigandBDBM50395340
Substrate/Competitorn/a
Meas. Tech.ChEMBL_860772 (CHEMBL2168492)
IC50 220±n/a nM
Citation Macsari, IBesidski, YCsjernyik, GNilsson, LISandberg, LYngve, UAhlin, KBueters, TEriksson, ABLund, PEVenyike, EOerther, SHygge Blakeman, KLuo, LArvidsson, PI 3-Oxoisoindoline-1-carboxamides: potent, state-dependent blockers of voltage-gated sodium channel Na(V)1.7 with efficacy in rat pain models. J Med Chem55:6866-80 (2012) 
 
Sodium channel protein type 9 subunit alpha
Name:Sodium channel protein type 9 subunit alpha
Type:Protein
Mol. Mass.:226375.97
Organism:Homo sapiens (Human)
Description:Q15858
Residue:1988
BDBM50395340
NameBDBM50395340
Synonyms:CHEMBL2164044
TypeSmall organic molecule
Emp. Form.C23H17F5N4O2
Mol. Mass.476.3987
SMILESFc1cnc(CCN2C(C(=O)NCc3ccc(F)c(c3)C(F)(F)F)c3ccccc3C2=O)nc1