Reaction Details
TargetSodium channel protein type 9 subunit alpha
LigandBDBM50395330
Substrate/Competitorn/a
Meas. Tech.ChEMBL_860772 (CHEMBL2168492)
IC50 360±n/a nM
Citation Macsari, IBesidski, YCsjernyik, GNilsson, LISandberg, LYngve, UAhlin, KBueters, TEriksson, ABLund, PEVenyike, EOerther, SHygge Blakeman, KLuo, LArvidsson, PI 3-Oxoisoindoline-1-carboxamides: potent, state-dependent blockers of voltage-gated sodium channel Na(V)1.7 with efficacy in rat pain models. J Med Chem55:6866-80 (2012) 
 
Sodium channel protein type 9 subunit alpha
Name:Sodium channel protein type 9 subunit alpha
Type:Protein
Mol. Mass.:226375.97
Organism:Homo sapiens (Human)
Description:Q15858
Residue:1988
BDBM50395330
NameBDBM50395330
Synonyms:CHEMBL2164392
TypeSmall organic molecule
Emp. Form.C25H22F3N3O3
Mol. Mass.469.4557
SMILESFC(F)(F)COc1ccc(CNC(=O)C2N(CCc3ccccn3)C(=O)c3ccccc23)cc1