Reaction Details
TargetPotassium voltage-gated channel subfamily KQT member 2
LigandBDBM50395333
Substrate/Competitorn/a
Meas. Tech.ChEMBL_860780 (CHEMBL2168500)
IC50 1600±n/a nM
Citation Macsari, IBesidski, YCsjernyik, GNilsson, LISandberg, LYngve, UAhlin, KBueters, TEriksson, ABLund, PEVenyike, EOerther, SHygge Blakeman, KLuo, LArvidsson, PI 3-Oxoisoindoline-1-carboxamides: potent, state-dependent blockers of voltage-gated sodium channel Na(V)1.7 with efficacy in rat pain models. J Med Chem55:6866-80 (2012) 
 
Potassium voltage-gated channel subfamily KQT member 2
Name:Potassium voltage-gated channel subfamily KQT member 2
Type:PROTEIN
Mol. Mass.:95883.20
Organism:Homo sapiens (Human)
Description:ChEMBL_1457496
Residue:872
BDBM50395333
NameBDBM50395333
Synonyms:CHEMBL2164389
TypeSmall organic molecule
Emp. Form.C24H20F3N3O3
Mol. Mass.455.4291
SMILESFC(F)(F)Oc1ccc(CNC(=O)C2N(CCc3ccccn3)C(=O)c3ccccc23)cc1