Reaction Details
TargetCarbonic anhydrase 1
LigandBDBM50395386
Substrate/Competitorn/a
Meas. Tech.ChEMBL_857984 (CHEMBL2166492)
Ki 950±n/a nM
Citation D'Ambrosio, KSmaine, FZCarta, FDe Simone, GWinum, JYSupuran, CT Development of potent carbonic anhydrase inhibitors incorporating both sulfonamide and sulfamide groups. J Med Chem55:6776-83 (2012) 
 
Carbonic anhydrase 1
Name:Carbonic anhydrase 1
Type:Enzyme
Mol. Mass.:28873.37
Organism:Homo sapiens (Human)
Description:P00915
Residue:261
BDBM50395386
NameBDBM50395386
Synonyms:CHEMBL2164732
TypeSmall organic molecule
Emp. Form.C12H14N4O6S3
Mol. Mass.406.458
SMILESNS(=O)(=O)Nc1ccc(cc1)S(=O)(=O)Nc1ccc(cc1)S(N)(=O)=O