Reaction Details
TargetCarbonic anhydrase 1
LigandBDBM50395387
Substrate/Competitorn/a
Meas. Tech.ChEMBL_857984 (CHEMBL2166492)
Ki 87±n/a nM
Citation D'Ambrosio, KSmaine, FZCarta, FDe Simone, GWinum, JYSupuran, CT Development of potent carbonic anhydrase inhibitors incorporating both sulfonamide and sulfamide groups. J Med Chem55:6776-83 (2012) 
 
Carbonic anhydrase 1
Name:Carbonic anhydrase 1
Type:Enzyme
Mol. Mass.:28873.37
Organism:Homo sapiens (Human)
Description:P00915
Residue:261
BDBM50395387
NameBDBM50395387
Synonyms:CHEMBL2164731
TypeSmall organic molecule
Emp. Form.C8H13N3O4S2
Mol. Mass.279.337
SMILESNS(=O)(=O)NCCc1ccc(cc1)S(N)(=O)=O