Reaction Details
TargetCarbonic anhydrase 12
LigandBDBM50395391
Substrate/Competitorn/a
Meas. Tech.ChEMBL_857985 (CHEMBL2166493)
Ki 0.5±n/a nM
Citation D'Ambrosio, KSmaine, FZCarta, FDe Simone, GWinum, JYSupuran, CT Development of potent carbonic anhydrase inhibitors incorporating both sulfonamide and sulfamide groups. J Med Chem55:6776-83 (2012) 
 
Carbonic anhydrase 12
Name:Carbonic anhydrase 12
Type:Enzyme
Mol. Mass.:39456.00
Organism:Homo sapiens (Human)
Description:Catalytic domain of human cloned isozyme was used in the assay
Residue:354
BDBM50395391
NameBDBM50395391
Synonyms:CHEMBL2164737
TypeSmall organic molecule
Emp. Form.C21H23N5O7S3
Mol. Mass.553.632
SMILESNS(=O)(=O)Nc1ccc(cc1)S(=O)(=O)Nc1ccc(cc1)C(=O)NCCc1ccc(cc1)S(N)(=O)=O