Reaction Details
TargetCarbonic anhydrase 12
LigandBDBM50395383
Substrate/Competitorn/a
Meas. Tech.ChEMBL_857985 (CHEMBL2166493)
Ki 79±n/a nM
Citation D'Ambrosio, KSmaine, FZCarta, FDe Simone, GWinum, JYSupuran, CT Development of potent carbonic anhydrase inhibitors incorporating both sulfonamide and sulfamide groups. J Med Chem55:6776-83 (2012) 
 
Carbonic anhydrase 12
Name:Carbonic anhydrase 12
Type:Enzyme
Mol. Mass.:39456.00
Organism:Homo sapiens (Human)
Description:Catalytic domain of human cloned isozyme was used in the assay
Residue:354
BDBM50395383
NameBDBM50395383
Synonyms:CHEMBL2164735
TypeSmall organic molecule
Emp. Form.C8H10N6O6S4
Mol. Mass.414.462
SMILESNS(=O)(=O)Nc1ccc(cc1)S(=O)(=O)Nc1nnc(s1)S(N)(=O)=O