Reaction Details
TargetCarbonic anhydrase 2
LigandBDBM50395392
Substrate/Competitorn/a
Meas. Tech.ChEMBL_857987 (CHEMBL2166495)
Ki 49±n/a nM
Citation D'Ambrosio, KSmaine, FZCarta, FDe Simone, GWinum, JYSupuran, CT Development of potent carbonic anhydrase inhibitors incorporating both sulfonamide and sulfamide groups. J Med Chem55:6776-83 (2012) 
 
Carbonic anhydrase 2
Name:Carbonic anhydrase 2
Type:Enzyme
Mol. Mass.:29250.71
Organism:Homo sapiens (Human)
Description:P00918
Residue:260
BDBM50395392
NameBDBM50395392
Synonyms:CHEMBL2164736
TypeSmall organic molecule
Emp. Form.C13H13N3O6S2
Mol. Mass.371.389
SMILESNS(=O)(=O)Nc1ccc(cc1)S(=O)(=O)Nc1ccc(cc1)C(O)=O