Reaction Details
TargetCarbonic anhydrase 2
LigandBDBM50395384
Substrate/Competitorn/a
Meas. Tech.ChEMBL_857987 (CHEMBL2166495)
Ki 63±n/a nM
Citation D'Ambrosio, KSmaine, FZCarta, FDe Simone, GWinum, JYSupuran, CT Development of potent carbonic anhydrase inhibitors incorporating both sulfonamide and sulfamide groups. J Med Chem55:6776-83 (2012) 
 
Carbonic anhydrase 2
Name:Carbonic anhydrase 2
Type:Enzyme
Mol. Mass.:29250.71
Organism:Homo sapiens (Human)
Description:P00918
Residue:260
BDBM50395384
NameBDBM50395384
Synonyms:CHEMBL2164734
TypeSmall organic molecule
Emp. Form.C14H18N4O6S3
Mol. Mass.434.511
SMILESNS(=O)(=O)Nc1ccc(cc1)S(=O)(=O)NCCc1ccc(cc1)S(N)(=O)=O