Reaction Details
TargetCarbonic anhydrase 2
LigandBDBM50395386
Substrate/Competitorn/a
Meas. Tech.ChEMBL_857987 (CHEMBL2166495)
Ki 9.1±n/a nM
Citation D'Ambrosio, KSmaine, FZCarta, FDe Simone, GWinum, JYSupuran, CT Development of potent carbonic anhydrase inhibitors incorporating both sulfonamide and sulfamide groups. J Med Chem55:6776-83 (2012) 
 
Carbonic anhydrase 2
Name:Carbonic anhydrase 2
Type:Enzyme
Mol. Mass.:29250.71
Organism:Homo sapiens (Human)
Description:P00918
Residue:260
BDBM50395386
NameBDBM50395386
Synonyms:CHEMBL2164732
TypeSmall organic molecule
Emp. Form.C12H14N4O6S3
Mol. Mass.406.458
SMILESNS(=O)(=O)Nc1ccc(cc1)S(=O)(=O)Nc1ccc(cc1)S(N)(=O)=O