Reaction Details
TargetFatty-acid amide hydrolase 1
LigandBDBM50275301
Substrate/Competitorn/a
Meas. Tech.ChEMBL_858268 (CHEMBL2168074)
IC50 14±n/a nM
Citation Butini, SBrindisi, MGemma, SMinetti, PCabri, WGallo, GVincenti, STalamonti, EBorsini, FCaprioli, AStasi, MADi Serio, SRos, SBorrelli, GMaramai, SFezza, FCampiani, GMaccarrone, M Discovery of potent inhibitors of human and mouse fatty acid amide hydrolases. J Med Chem55:6898-915 (2012) 
 
Fatty-acid amide hydrolase 1
Name:Fatty-acid amide hydrolase 1
Type:Protein
Mol. Mass.:63071.19
Organism:Homo sapiens (Human)
Description:O00519
Residue:579
BDBM50275301
NameBDBM50275301
Synonyms:3'-carbamoylbiphenyl-3-yl 6-phenylhexylcarbamate | CHEMBL451909
TypeSmall organic molecule
Emp. Form.C26H28N2O3
Mol. Mass.416.5121
SMILESNC(=O)c1cccc(c1)-c1cccc(OC(=O)NCCCCCCc2ccccc2)c1