Reaction Details
TargetFatty-acid amide hydrolase 1
LigandBDBM50132713
Substrate/Competitorn/a
Meas. Tech.ChEMBL_858267 (CHEMBL2168073)
IC50 1±n/a nM
Citation Butini, SBrindisi, MGemma, SMinetti, PCabri, WGallo, GVincenti, STalamonti, EBorsini, FCaprioli, AStasi, MADi Serio, SRos, SBorrelli, GMaramai, SFezza, FCampiani, GMaccarrone, M Discovery of potent inhibitors of human and mouse fatty acid amide hydrolases. J Med Chem55:6898-915 (2012) 
 
Fatty-acid amide hydrolase 1
Name:Fatty-acid amide hydrolase 1
Type:Protein
Mol. Mass.:63071.19
Organism:Homo sapiens (Human)
Description:O00519
Residue:579
BDBM50132713
NameBDBM50132713
Synonyms:Arachidonic acid derivative Methyl arachidonoyl fluorophophonate methyl (5Z,8Z,11Z,14Z)-icosa-5,8,11,14-tetraenylphosphonofluoridate methyl(5Z,8Z,11Z,14Z)-icosa-5,8,11,14-tetraenylphosphonofluoridate | methylarachidonyl fluorophosphonate
TypeSmall organic molecule
Emp. Form.C21H36FO2P
Mol. Mass.370.4815
SMILESCCCCC\C=C/C\C=C/C\C=C/C\C=C/CCCCP(F)(=O)OC