Reaction Details
TargetCytochrome P450 1A2
LigandBDBM50395464
Substrate/Competitorn/a
Meas. Tech.ChEMBL_858509 (CHEMBL2169308)
IC50 6100±n/a nM
Citation Cheung, YYYu, HXu, KZou, BWu, MMcManus, OBLi, MLindsley, CWHopkins, CR Discovery of a series of 2-phenyl-N-(2-(pyrrolidin-1-yl)phenyl)acetamides as novel molecular switches that modulate modes of K(v)7.2 (KCNQ2) channel pharmacology: identification of (S)-2-phenyl-N-(2-(pyrrolidin-1-yl)phenyl)butanamide (ML252) as a potent, brain penetrant K(v)7.2 channel inhibitor. J Med Chem55:6975-9 (2012) 
 
Cytochrome P450 1A2
Name:Cytochrome P450 1A2
Type:Enzyme
Mol. Mass.:58423.38
Organism:Homo sapiens (Human)
Description:P05177
Residue:516
BDBM50395464
NameBDBM50395464
Synonyms:CHEMBL2164048
TypeSmall organic molecule
Emp. Form.C20H24N2O
Mol. Mass.308.4174
SMILESCC[C@H](C(=O)Nc1ccccc1N1CCCC1)c1ccccc1