Reaction Details
TargetPotassium voltage-gated channel subfamily KQT member 2
LigandBDBM50395488
Substrate/Competitorn/a
Meas. Tech.ChEMBL_858528 (CHEMBL2169532)
EC50 350±n/a nM
Citation Cheung, YYYu, HXu, KZou, BWu, MMcManus, OBLi, MLindsley, CWHopkins, CR Discovery of a series of 2-phenyl-N-(2-(pyrrolidin-1-yl)phenyl)acetamides as novel molecular switches that modulate modes of K(v)7.2 (KCNQ2) channel pharmacology: identification of (S)-2-phenyl-N-(2-(pyrrolidin-1-yl)phenyl)butanamide (ML252) as a potent, brain penetrant K(v)7.2 channel inhibitor. J Med Chem55:6975-9 (2012) 
 
Potassium voltage-gated channel subfamily KQT member 2
Name:Potassium voltage-gated channel subfamily KQT member 2
Type:PROTEIN
Mol. Mass.:95883.20
Organism:Homo sapiens (Human)
Description:ChEMBL_1457496
Residue:872
BDBM50395488
NameBDBM50395488
Synonyms:CHEMBL1572950
TypeSmall organic molecule
Emp. Form.C19H19F3N2O
Mol. Mass.348.3622
SMILESFC(F)(F)c1cccc(CC(=O)Nc2ccccc2N2CCCC2)c1