Reaction Details
TargetPotassium voltage-gated channel subfamily KQT member 2
LigandBDBM50395494
Substrate/Competitorn/a
Meas. Tech.ChEMBL_858528 (CHEMBL2169532)
EC50 1730±n/a nM
Citation Cheung, YYYu, HXu, KZou, BWu, MMcManus, OBLi, MLindsley, CWHopkins, CR Discovery of a series of 2-phenyl-N-(2-(pyrrolidin-1-yl)phenyl)acetamides as novel molecular switches that modulate modes of K(v)7.2 (KCNQ2) channel pharmacology: identification of (S)-2-phenyl-N-(2-(pyrrolidin-1-yl)phenyl)butanamide (ML252) as a potent, brain penetrant K(v)7.2 channel inhibitor. J Med Chem55:6975-9 (2012) 
 
Potassium voltage-gated channel subfamily KQT member 2
Name:Potassium voltage-gated channel subfamily KQT member 2
Type:PROTEIN
Mol. Mass.:95883.20
Organism:Homo sapiens (Human)
Description:ChEMBL_1457496
Residue:872
BDBM50395494
NameBDBM50395494
Synonyms:CHEMBL2164063
TypeSmall organic molecule
Emp. Form.C18H18F2N2O
Mol. Mass.316.3451
SMILESFc1ccc(CC(=O)Nc2ccccc2N2CCCC2)cc1F