Reaction Details
TargetInhibitor of nuclear factor kappa-B kinase subunit beta
LigandBDBM50395524
Substrate/Competitorn/a
Meas. Tech.ChEMBL_858723 (CHEMBL2167034)
IC50 6.31±n/a nM
Citation Liddle, JBamborough, PBarker, MDCampos, SChung, CWCousins, RPFaulder, PHeathcote, MLHobbs, HHolmes, DSIoannou, CRamirez-Molina, CMorse, MAOsborn, RPayne, JJPritchard, JMRumsey, WLTape, DTVicentini, GWhitworth, CWilliamson, RA 4-Phenyl-7-azaindoles as potent, selective and bioavailable IKK2 inhibitors demonstrating good in vivo efficacy. Bioorg Med Chem Lett22:5222-6 (2012) 
 
Inhibitor of nuclear factor kappa-B kinase subunit beta
Name:Inhibitor of nuclear factor kappa-B kinase subunit beta
Type:Serine/threonine-protein kinase
Mol. Mass.:86554.39
Organism:Homo sapiens (Human)
Description:GST-tagged IKK-2 was expressed in High Five cells and purified.
Residue:756
BDBM50395524
NameBDBM50395524
Synonyms:CHEMBL2164424
TypeSmall organic molecule
Emp. Form.C20H23N3O3S
Mol. Mass.385.48
SMILESCC(C)(O)CNS(=O)(=O)c1ccc(cc1)-c1ccnc2[nH]c(cc12)C1CC1