Reaction Details
TargetInhibitor of nuclear factor kappa-B kinase subunit beta
LigandBDBM50395532
Substrate/Competitorn/a
Meas. Tech.ChEMBL_858723 (CHEMBL2167034)
IC50 15.85±n/a nM
Citation Liddle, JBamborough, PBarker, MDCampos, SChung, CWCousins, RPFaulder, PHeathcote, MLHobbs, HHolmes, DSIoannou, CRamirez-Molina, CMorse, MAOsborn, RPayne, JJPritchard, JMRumsey, WLTape, DTVicentini, GWhitworth, CWilliamson, RA 4-Phenyl-7-azaindoles as potent, selective and bioavailable IKK2 inhibitors demonstrating good in vivo efficacy. Bioorg Med Chem Lett22:5222-6 (2012) 
 
Inhibitor of nuclear factor kappa-B kinase subunit beta
Name:Inhibitor of nuclear factor kappa-B kinase subunit beta
Type:Serine/threonine-protein kinase
Mol. Mass.:86554.39
Organism:Homo sapiens (Human)
Description:GST-tagged IKK-2 was expressed in High Five cells and purified.
Residue:756
BDBM50395532
NameBDBM50395532
Synonyms:CHEMBL2164416
TypeSmall organic molecule
Emp. Form.C21H22N6O4S2
Mol. Mass.486.567
SMILESO=S(=O)(NC1CCS(=O)(=O)CC1)c1ccc(cc1)-c1ccnc2[nH]c(Cn3ccnn3)cc12