Reaction Details
TargetD(2) dopamine receptor
LigandBDBM50395572
Substrate/Competitorn/a
Meas. Tech.ChEMBL_859682 (CHEMBL2169117)
Ki 104±n/a nM
Citation Chen, XSassano, MFZheng, LSetola, VChen, MBai, XFrye, SVWetsel, WCRoth, BLJin, J Structure-functional selectivity relationship studies ofß-arrestin-biased dopamine D2 receptor agonists. J Med Chem55:7141-53 (2012) 
 
D(2) dopamine receptor
Name:D(2) dopamine receptor
Type:Cell-surface receptors
Mol. Mass.:50647.10
Organism:Homo sapiens (Human)
Description:P14416
Residue:443
BDBM50395572
NameBDBM50395572
Synonyms:CHEMBL2165116 US9156822, 20
TypeSmall organic molecule
Emp. Form.C20H22Cl2N4O
Mol. Mass.405.321
SMILESClc1cccc(N2CCN(CCCOc3ccc4cn[nH]c4c3)CC2)c1Cl