Reaction Details
TargetD(2) dopamine receptor
LigandBDBM50343260
Substrate/Competitorn/a
Meas. Tech.ChEMBL_859682 (CHEMBL2169117)
Ki 3.4±n/a nM
Citation Chen, XSassano, MFZheng, LSetola, VChen, MBai, XFrye, SVWetsel, WCRoth, BLJin, J Structure-functional selectivity relationship studies ofß-arrestin-biased dopamine D2 receptor agonists. J Med Chem55:7141-53 (2012) 
 
D(2) dopamine receptor
Name:D(2) dopamine receptor
Type:Cell-surface receptors
Mol. Mass.:50647.10
Organism:Homo sapiens (Human)
Description:P14416
Residue:443
BDBM50343260
NameBDBM50343260
Synonyms:7-(4-(4-(2,3-dichlorophenyl)piperazin-1-yl)butoxy)-3,4-dihydro-1,8-naphthyridin-2(1H)-one | CHEMBL1774063
TypeSmall organic molecule
Emp. Form.C22H26Cl2N4O2
Mol. Mass.449.373
SMILESClc1cccc(N2CCN(CCCCOc3ccc4CCC(=O)Nc4n3)CC2)c1Cl