Reaction Details
Target5-hydroxytryptamine receptor 1A
LigandBDBM50395578
Substrate/Competitorn/a
Meas. Tech.ChEMBL_859668 (CHEMBL2168905)
Ki 0.6±n/a nM
Citation Chen, XSassano, MFZheng, LSetola, VChen, MBai, XFrye, SVWetsel, WCRoth, BLJin, J Structure-functional selectivity relationship studies ofß-arrestin-biased dopamine D2 receptor agonists. J Med Chem55:7141-53 (2012) 
 
5-hydroxytryptamine receptor 1A
Name:5-hydroxytryptamine receptor 1A
Type:n/a
Mol. Mass.:46122.49
Organism:Homo sapiens (Human)
Description:n/a
Residue:422
BDBM50395578
NameBDBM50395578
Synonyms:CHEMBL2165137 US9156822, 21
TypeSmall organic molecule
Emp. Form.C22H24Cl2N2OS
Mol. Mass.435.41
SMILESClc1cccc(C2CCN(CCCCOc3ccc4scnc4c3)CC2)c1Cl