Reaction Details
TargetD(2) dopamine receptor
LigandBDBM50395573
Substrate/Competitorn/a
Meas. Tech.ChEMBL_859679 (CHEMBL2168916)
EC50 20±n/a nM
Citation Chen, XSassano, MFZheng, LSetola, VChen, MBai, XFrye, SVWetsel, WCRoth, BLJin, J Structure-functional selectivity relationship studies ofß-arrestin-biased dopamine D2 receptor agonists. J Med Chem55:7141-53 (2012) 
 
D(2) dopamine receptor
Name:D(2) dopamine receptor
Type:Cell-surface receptors
Mol. Mass.:50647.10
Organism:Homo sapiens (Human)
Description:P14416
Residue:443
BDBM50395573
NameBDBM50395573
Synonyms:CHEMBL2165115 US9156822, 24
TypeSmall organic molecule
Emp. Form.C22H25Cl2N3O2
Mol. Mass.434.359
SMILESClc1cccc(C2CCN(CCCCOc3ccc4[nH]c(=O)[nH]c4c3)CC2)c1Cl