Reaction Details
TargetD(2) dopamine receptor
LigandBDBM50395583
Substrate/Competitorn/a
Meas. Tech.ChEMBL_859682 (CHEMBL2169117)
Ki 108±n/a nM
Citation Chen, XSassano, MFZheng, LSetola, VChen, MBai, XFrye, SVWetsel, WCRoth, BLJin, J Structure-functional selectivity relationship studies ofß-arrestin-biased dopamine D2 receptor agonists. J Med Chem55:7141-53 (2012) 
 
D(2) dopamine receptor
Name:D(2) dopamine receptor
Type:Cell-surface receptors
Mol. Mass.:50647.10
Organism:Homo sapiens (Human)
Description:P14416
Residue:443
BDBM50395583
NameBDBM50395583
Synonyms:CHEMBL2165132 US9156822, 31
TypeSmall organic molecule
Emp. Form.C26H25Cl2N3O2
Mol. Mass.482.402
SMILESClc1cccc(N2CCN(Cc3ccc(Oc4ccc5CCC(=O)Nc5c4)cc3)CC2)c1Cl