Reaction Details
TargetD(2) dopamine receptor
LigandBDBM50395556
Substrate/Competitorn/a
Meas. Tech.ChEMBL_859682 (CHEMBL2169117)
Ki 11±n/a nM
Citation Chen, XSassano, MFZheng, LSetola, VChen, MBai, XFrye, SVWetsel, WCRoth, BLJin, J Structure-functional selectivity relationship studies ofß-arrestin-biased dopamine D2 receptor agonists. J Med Chem55:7141-53 (2012) 
 
D(2) dopamine receptor
Name:D(2) dopamine receptor
Type:Cell-surface receptors
Mol. Mass.:50647.10
Organism:Homo sapiens (Human)
Description:P14416
Residue:443
BDBM50395556
NameBDBM50395556
Synonyms:CHEMBL2165125
TypeSmall organic molecule
Emp. Form.C24H28Cl2N2O2
Mol. Mass.447.397
SMILESClc1cccc(C2CCN(CCCCOc3ccc4CCC(=O)Nc4c3)CC2)c1Cl