Reaction Details
TargetD(2) dopamine receptor
LigandBDBM50349866
Substrate/Competitorn/a
Meas. Tech.ChEMBL_859682 (CHEMBL2169117)
Ki 0.3±n/a nM
Citation Chen, XSassano, MFZheng, LSetola, VChen, MBai, XFrye, SVWetsel, WCRoth, BLJin, J Structure-functional selectivity relationship studies ofß-arrestin-biased dopamine D2 receptor agonists. J Med Chem55:7141-53 (2012) 
 
D(2) dopamine receptor
Name:D(2) dopamine receptor
Type:Cell-surface receptors
Mol. Mass.:50647.10
Organism:Homo sapiens (Human)
Description:P14416
Residue:443
BDBM50349866
NameBDBM50349866
Synonyms:CHEMBL160296 UNC10108016 | US9156822, 39
TypeSmall organic molecule
Emp. Form.C24H31N3O3
Mol. Mass.409.5212
SMILESCOc1ccccc1N1CCN(CCCCOc2ccc3CCC(=O)Nc3c2)CC1