Reaction Details
TargetGlutathione S-transferase A1
LigandBDBM50395590
Substrate/Competitorn/a
Meas. Tech.ChEMBL_859685 (CHEMBL2169120)
Ki 71000±n/a nM
Citation Koutsoumpli, GEDimaki, VDThireou, TNEliopoulos, EELabrou, NEVarvounis, GIClonis, YD Synthesis and study of 2-(pyrrolesulfonylmethyl)-N-arylimines: a new class of inhibitors for human glutathione transferase A1-1. J Med Chem55:6802-13 (2012) 
 
Glutathione S-transferase A1
Name:Glutathione S-transferase A1
Type:Enzyme
Mol. Mass.:25636.31
Organism:Homo sapiens (Human)
Description:Glutathione-S-Transferase (GST, N-terminally)
Residue:222
BDBM50395590
NameBDBM50395590
Synonyms:CHEMBL2165141
TypeSmall organic molecule
Emp. Form.C19H17N3O4S
Mol. Mass.383.421
SMILESCn1cccc1S(=O)(=O)Cc1ccccc1\N=C\c1ccc(cc1)[N+]([O-])=O