Reaction Details
TargetEndothelin-1 receptor
LigandBDBM50395646
Substrate/Competitorn/a
Meas. Tech.ChEMBL_859881 (CHEMBL2166382)
IC50 1.7±n/a nM
Citation Bolli, MHBoss, CBinkert, CBuchmann, SBur, DHess, PIglarz, MMeyer, SRein, JRey, MTreiber, AClozel, MFischli, WWeller, T The discovery of N-[5-(4-bromophenyl)-6-[2-[(5-bromo-2-pyrimidinyl)oxy]ethoxy]-4-pyrimidinyl]-N'-propylsulfamide (Macitentan), an orally active, potent dual endothelin receptor antagonist. J Med Chem55:7849-61 (2012) 
 
Endothelin-1 receptor
Name:Endothelin-1 receptor
Type:Enzyme Catalytic Domain
Mol. Mass.:48736.88
Organism:Homo sapiens (Human)
Description:P25101
Residue:427
BDBM50395646
NameBDBM50395646
Synonyms:CHEMBL2163720
TypeSmall organic molecule
Emp. Form.C25H27BrN8O6S
Mol. Mass.647.501
SMILESCCCCNS(=O)(=O)Nc1nc(nc(OCCOc2ncc(Br)cn2)c1Oc1ccccc1OC)-c1ncccn1