Reaction Details
TargetA disintegrin and metalloproteinase with thrombospondin motifs 5
LigandBDBM50395699
Substrate/Competitorn/a
Meas. Tech.ChEMBL_860056 (CHEMBL2167992)
IC50 5800±n/a nM
Citation Deng, HO'Keefe, HDavie, CPLind, KEAcharya, RAFranklin, GJLarkin, JMatico, RNeeb, MThompson, MMLohr, TGross, JWCentrella, PAO'Donovan, GKBedard, KLvan Vloten, KMataruse, SSkinner, SRBelyanskaya, SLCarpenter, TYShearer, TWClark, MACuozzo, JWArico-Muendel, CCMorgan, BA Discovery of highly potent and selective small molecule ADAMTS-5 inhibitors that inhibit human cartilage degradation via encoded library technology (ELT). J Med Chem55:7061-79 (2012) 
 
A disintegrin and metalloproteinase with thrombospondin motifs 5
Name:A disintegrin and metalloproteinase with thrombospondin motifs 5
Type:Enzyme
Mol. Mass.:101769.09
Organism:Homo sapiens (Human)
Description:Q9UNA0
Residue:930
BDBM50395699
NameBDBM50395699
Synonyms:CHEMBL2164098
TypeSmall organic molecule
Emp. Form.C24H39N7O2S
Mol. Mass.489.677
SMILESCCCCNc1nc(NC(C)C)nc(n1)N1CCC[C@@H]1CNS(=O)(=O)c1ccc(CCC)cc1