Reaction Details
TargetDisintegrin and metalloproteinase domain-containing protein 17
LigandBDBM50395675
Substrate/Competitorn/a
Meas. Tech.ChEMBL_860055 (CHEMBL2167991)
IC50 7900±n/a nM
Citation Deng, HO'Keefe, HDavie, CPLind, KEAcharya, RAFranklin, GJLarkin, JMatico, RNeeb, MThompson, MMLohr, TGross, JWCentrella, PAO'Donovan, GKBedard, KLvan Vloten, KMataruse, SSkinner, SRBelyanskaya, SLCarpenter, TYShearer, TWClark, MACuozzo, JWArico-Muendel, CCMorgan, BA Discovery of highly potent and selective small molecule ADAMTS-5 inhibitors that inhibit human cartilage degradation via encoded library technology (ELT). J Med Chem55:7061-79 (2012) 
 
Disintegrin and metalloproteinase domain-containing protein 17
Name:Disintegrin and metalloproteinase domain-containing protein 17
Type:Enzyme
Mol. Mass.:93007.89
Organism:Homo sapiens (Human)
Description:
Residue:824
BDBM50395675
NameBDBM50395675
Synonyms:CHEMBL2164094
TypeSmall organic molecule
Emp. Form.C25H37N9O2S
Mol. Mass.527.685
SMILESCCCNc1nc(NCc2cn(C)cn2)nc(n1)N1CCC[C@@H]1CNS(=O)(=O)c1ccc(CCC)cc1