Reaction Details
TargetCarboxypeptidase B2
LigandBDBM50395736
Substrate/Competitorn/a
Meas. Tech.ChEMBL_860204 (CHEMBL2168944)
IC50 30.0±n/a nM
Citation Yoshimoto, NSasaki, TSugimoto, KIshii, HYamamoto, K Design and characterization of a selenium-containing inhibitor of activated thrombin-activatable fibrinolysis inhibitor (TAFIa), a zinc-containing metalloprotease. J Med Chem55:7696-705 (2012) 
 
Carboxypeptidase B2
Name:Carboxypeptidase B2
Type:Enzyme
Mol. Mass.:48432.74
Organism:Homo sapiens (Human)
Description:Q96IY4
Residue:423
BDBM50395736
NameBDBM50395736
Synonyms:CHEMBL2164458
TypeSmall organic molecule
Emp. Form.C13H25NO3Se
Mol. Mass.322.3
SMILESCCOC(=O)C(CCCCCN)C[Se]C(=O)CC