Reaction Details
TargetCarboxypeptidase B2
LigandBDBM50395734
Substrate/Competitorn/a
Meas. Tech.ChEMBL_860207 (CHEMBL2168947)
IC50 1600±n/a nM
Citation Yoshimoto, NSasaki, TSugimoto, KIshii, HYamamoto, K Design and characterization of a selenium-containing inhibitor of activated thrombin-activatable fibrinolysis inhibitor (TAFIa), a zinc-containing metalloprotease. J Med Chem55:7696-705 (2012) 
 
Carboxypeptidase B2
Name:Carboxypeptidase B2
Type:Enzyme
Mol. Mass.:48432.74
Organism:Homo sapiens (Human)
Description:Q96IY4
Residue:423
BDBM50395734
NameBDBM50395734
Synonyms:CHEMBL2164460
TypeSmall organic molecule
Emp. Form.C18H27NO3Se
Mol. Mass.384.37
SMILESNCCCCCC(C[Se]C(=O)CCCc1ccccc1)C(O)=O