Reaction Details
TargetCarboxypeptidase B2
LigandBDBM50395735
Substrate/Competitorn/a
Meas. Tech.ChEMBL_860207 (CHEMBL2168947)
IC50 760±n/a nM
Citation Yoshimoto, NSasaki, TSugimoto, KIshii, HYamamoto, K Design and characterization of a selenium-containing inhibitor of activated thrombin-activatable fibrinolysis inhibitor (TAFIa), a zinc-containing metalloprotease. J Med Chem55:7696-705 (2012) 
 
Carboxypeptidase B2
Name:Carboxypeptidase B2
Type:Enzyme
Mol. Mass.:48432.74
Organism:Homo sapiens (Human)
Description:Q96IY4
Residue:423
BDBM50395735
NameBDBM50395735
Synonyms:CHEMBL2164459
TypeSmall organic molecule
Emp. Form.C11H21NO3Se
Mol. Mass.294.25
SMILESCCC(=O)[Se]CC(CCCCCN)C(O)=O