Reaction Details
TargetCarboxypeptidase B2
LigandBDBM50395730
Substrate/Competitorn/a
Meas. Tech.ChEMBL_860204 (CHEMBL2168944)
IC50 0.025±n/a nM
Citation Yoshimoto, NSasaki, TSugimoto, KIshii, HYamamoto, K Design and characterization of a selenium-containing inhibitor of activated thrombin-activatable fibrinolysis inhibitor (TAFIa), a zinc-containing metalloprotease. J Med Chem55:7696-705 (2012) 
 
Carboxypeptidase B2
Name:Carboxypeptidase B2
Type:Enzyme
Mol. Mass.:48432.74
Organism:Homo sapiens (Human)
Description:Q96IY4
Residue:423
BDBM50395730
NameBDBM50395730
Synonyms:CHEMBL2164450
TypeSmall organic molecule
Emp. Form.C18H20Cl2N4O4Se2
Mol. Mass.585.2
SMILESNc1ncc(CC(C[Se][Se]CC(Cc2cnc(N)c(Cl)c2)C(O)=O)C(O)=O)cc1Cl