Reaction Details
TargetCarboxypeptidase B
LigandBDBM50395734
Substrate/Competitorn/a
Meas. Tech.ChEMBL_860203 (CHEMBL2168943)
IC50 3.2±n/a nM
Citation Yoshimoto, NSasaki, TSugimoto, KIshii, HYamamoto, K Design and characterization of a selenium-containing inhibitor of activated thrombin-activatable fibrinolysis inhibitor (TAFIa), a zinc-containing metalloprotease. J Med Chem55:7696-705 (2012) 
 
Carboxypeptidase B
Name:Carboxypeptidase B
Type:PROTEIN
Mol. Mass.:47371.10
Organism:Sus scrofa
Description:ChEMBL_453905
Residue:416
BDBM50395734
NameBDBM50395734
Synonyms:CHEMBL2164460
TypeSmall organic molecule
Emp. Form.C18H27NO3Se
Mol. Mass.384.37
SMILESNCCCCCC(C[Se]C(=O)CCCc1ccccc1)C(O)=O