Reaction Details
TargetCarboxypeptidase B
LigandBDBM50395729
Substrate/Competitorn/a
Meas. Tech.ChEMBL_860203 (CHEMBL2168943)
IC50 130000±n/a nM
Citation Yoshimoto, NSasaki, TSugimoto, KIshii, HYamamoto, K Design and characterization of a selenium-containing inhibitor of activated thrombin-activatable fibrinolysis inhibitor (TAFIa), a zinc-containing metalloprotease. J Med Chem55:7696-705 (2012) 
 
Carboxypeptidase B
Name:Carboxypeptidase B
Type:PROTEIN
Mol. Mass.:47371.10
Organism:Sus scrofa
Description:ChEMBL_453905
Residue:416
BDBM50395729
NameBDBM50395729
Synonyms:CHEMBL2164451
TypeSmall organic molecule
Emp. Form.C14H19ClN2O3Se
Mol. Mass.377.73
SMILESCCOC(=O)C(C[Se]C(=O)CC)Cc1cnc(N)c(Cl)c1