Reaction Details
TargetGrowth hormone secretagogue receptor type 1
LigandBDBM50395751
Substrate/Competitorn/a
Meas. Tech.ChEMBL_860219 (CHEMBL2169160)
Ki 3±n/a nM
Citation Puleo, LMarini, PAvallone, RZanchet, MBandiera, SBaroni, MCroci, T Synthesis and pharmacological evaluation of indolinone derivatives as novel ghrelin receptor antagonists. Bioorg Med Chem20:5623-36 (2012) 
 
Growth hormone secretagogue receptor type 1
Name:Growth hormone secretagogue receptor type 1
Type:Receptor
Mol. Mass.:41334.57
Organism:Homo sapiens (Human)
Description:Receptor binding studies use plasma membranes from LLC PK-1 cells transiently transfected with hGHSR1a.
Residue:366
BDBM50395751
NameBDBM50395751
Synonyms:CHEMBL2164507
TypeSmall organic molecule
Emp. Form.C23H23Cl4N3O2
Mol. Mass.515.26
SMILESCCN1CCC(CC(=O)NC2(C(=O)Nc3cc(Cl)cc(Cl)c23)c2ccc(Cl)c(Cl)c2)CC1