Reaction Details
TargetCytochrome P450 2C9
LigandBDBM50395799
Substrate/Competitorn/a
Meas. Tech.ChEMBL_860474 (CHEMBL2166643)
IC50>50000±n/a nM
Citation Surivet, JPLange, RHubschwerlen, CKeck, WSpecklin, JLRitz, DBur, DLocher, HSeiler, PStrasser, DSPrade, LKohl, CSchmitt, CChapoux, GIlhan, EEkambaram, NAthanasiou, AKnezevic, ASabato, DChambovey, AGaertner, MEnderlin, MBoehme, MSippel, VWyss, P Structure-guided design, synthesis and biological evaluation of novel DNA ligase inhibitors with in vitro and in vivo anti-staphylococcal activity. Bioorg Med Chem Lett22:6705-11 (2012) 
 
Cytochrome P450 2C9
Name:Cytochrome P450 2C9
Type:Enzyme
Mol. Mass.:55636.33
Organism:Homo sapiens (Human)
Description:P11712
Residue:490
BDBM50395799
NameBDBM50395799
Synonyms:CHEMBL2163365
TypeSmall organic molecule
Emp. Form.C10H6BrF3N4O
Mol. Mass.335.08
SMILESNC(=O)c1cc2cc(Br)c(nc2nc1N)C(F)(F)F