Reaction Details
TargetDNA ligase
LigandBDBM50395800
Substrate/Competitorn/a
Meas. Tech.ChEMBL_860483 (CHEMBL2166652)
IC50 2500±n/a nM
Citation Surivet, JPLange, RHubschwerlen, CKeck, WSpecklin, JLRitz, DBur, DLocher, HSeiler, PStrasser, DSPrade, LKohl, CSchmitt, CChapoux, GIlhan, EEkambaram, NAthanasiou, AKnezevic, ASabato, DChambovey, AGaertner, MEnderlin, MBoehme, MSippel, VWyss, P Structure-guided design, synthesis and biological evaluation of novel DNA ligase inhibitors with in vitro and in vivo anti-staphylococcal activity. Bioorg Med Chem Lett22:6705-11 (2012) 
 
DNA ligase
Name:DNA ligase
Type:PROTEIN
Mol. Mass.:75059.93
Organism:Staphylococcus aureus
Description:ChEMBL_1281598
Residue:667
BDBM50395800
NameBDBM50395800
Synonyms:CHEMBL2165174
TypeSmall organic molecule
Emp. Form.C11H9N5O
Mol. Mass.227.2221
SMILESNc1cc(n[nH]c1=O)-c1nc2ccccc2[nH]1