Reaction Details
TargetPhosphatidylinositol 4,5-bisphosphate 3-kinase catalytic subunit beta isoform
LigandBDBM50395820
Substrate/Competitorn/a
Meas. Tech.ChEMBL_860617 (CHEMBL2167591)
IC50 34±n/a nM
Citation Giordanetto, FWållberg, AGhosal, SIliefski, TCassel, JYuan, ZQvon Wachenfeldt, HAndersen, SMInghardt, TTunek, ANylander, S Discovery of phosphoinositide 3-kinases (PI3K) p110ß isoform inhibitor 4-[2-hydroxyethyl(1-naphthylmethyl)amino]-6-[(2S)-2-methylmorpholin-4-yl]-1H-pyrimidin-2-one, an effective antithrombotic agent without associated bleeding and insulin resistance. Bioorg Med Chem Lett22:6671-6 (2012) 
 
Phosphatidylinositol 4,5-bisphosphate 3-kinase catalytic subunit beta isoform
Name:Phosphatidylinositol 4,5-bisphosphate 3-kinase catalytic subunit beta isoform
Type:Enzyme Subunit
Mol. Mass.:122769.00
Organism:Homo sapiens (Human)
Description:P42338
Residue:1070
BDBM50395820
NameBDBM50395820
Synonyms:CHEMBL2165192
TypeSmall organic molecule
Emp. Form.C20H22N4O2
Mol. Mass.350.4143
SMILESCC1CN(CCO1)c1cc(=O)[nH]c(NCc2cccc3ccccc23)n1